MySQL Forums
Forum List  »  Source, Builds, Binaries

Re: How can i make a MySQL8 tar package like offcial tar package through source build?
Posted by: 仁刚 谭
Date: April 08, 2020 11:34PM

I am sad to say: gcc8 can't solve the problem.

I use gcc-8.3.0 and build it use command follow:
../configure --prefix=/usr/local/gcc-8.3.0 --enable-shared --enable-threads=posix --enable-languages=c,c++,fortran --disable-multilib
make && make install

when i make the MySQL 8, it still throw errors like before.
so i thought about why offical limit gcc5.3+, because gcc5.3+ include the high version of libstdc++.so.6 that MySQL8 needed
so i wonder how does offical did it that offical tarball run rely on low version libstdc++.so.6 when offical tarball make rely on high version libstdc++.so.6
"As I said, the official tarball it built with Red Hat's Developer Studio 8 which includes gcc 8. This does *not* have its own libstdc++ but uses the system 6.0.19. That is why the MySQL built with it also can use 6.0.19."-I doubt it base on my test, if "This does *not* have its own libstdc++ but uses the system 6.0.19" is right, MySQL8's make should thow error like me.





make MySQL8's error:

Scanning dependencies of target uca9dump
[ 25%] Building CXX object strings/CMakeFiles/uca9dump.dir/uca9-dump.cc.o
[ 25%] Linking CXX executable ../runtime_output_directory/uca9dump
[ 25%] Built target uca9dump
[ 25%] Generating uca900_zh_tbls.cc, uca900_ja_tbls.cc
../runtime_output_directory/uca9dump: /lib64/libstdc++.so.6: version 'CXXABI_1.3.9' not found (required by ../runtime_output_directory/uca9dump)
make[2]: *** [strings/uca900_zh_tbls.cc] Error 1
make[1]: *** [strings/CMakeFiles/strings_objlib.dir/all] Error 2
make: *** [all] Error 2

Scanning dependencies of target GenError
[ 30%] Generating ../include/mysqld_error.h, ../share/english/errmsg.sys
../runtime_output_directory/comp_err: /lib64/libstdc++.so.6: version `GLIBCXX_3.4.20' not found (required by ../runtime_output_directory/comp_err)
../runtime_output_directory/comp_err: /lib64/libstdc++.so.6: version `CXXABI_1.3.9' not found (required by ../runtime_output_directory/comp_err)
../runtime_output_directory/comp_err: /lib64/libstdc++.so.6: version `GLIBCXX_3.4.21' not found (required by ../runtime_output_directory/comp_err)
make[2]: *** [include/mysqld_error.h] Error 1
make[1]: *** [utilities/CMakeFiles/GenError.dir/all] Error 2
make: *** [all] Error 2

Scanning dependencies of target libmysql_api_test
[ 30%] Building C object libmysql/CMakeFiles/libmysql_api_test.dir/api_test.c.o
[ 30%] Linking CXX executable ../runtime_output_directory/libmysql_api_test
../runtime_output_directory/libmysql_api_test: /lib64/libstdc++.so.6: version `GLIBCXX_3.4.20' not found (required by /data/mysql-8.0.18/bld/library_output_directory/libmysqlclient.so.21)
../runtime_output_directory/libmysql_api_test: /lib64/libstdc++.so.6: version `CXXABI_1.3.9' not found (required by /data/mysql-8.0.18/bld/library_output_directory/libmysqlclient.so.21)
../runtime_output_directory/libmysql_api_test: /lib64/libstdc++.so.6: version `GLIBCXX_3.4.21' not found (required by /data/mysql-8.0.18/bld/library_output_directory/libmysqlclient.so.21)
make[2]: *** [runtime_output_directory/libmysql_api_test] Error 1
make[2]: *** Deleting file `runtime_output_directory/libmysql_api_test'
make[1]: *** [libmysql/CMakeFiles/libmysql_api_test.dir/all] Error 2
make: *** [all] Error 2

Scanning dependencies of target GenLiteProtos
[ 40%] transform_to_lite /data/mysql-8.0.18/plugin/x/protocol/protobuf/mysqlx.proto
[ 40%] transform_to_lite /data/mysql-8.0.18/plugin/x/protocol/protobuf/mysqlx_datatypes.proto
[ 40%] transform_to_lite /data/mysql-8.0.18/plugin/x/protocol/protobuf/mysqlx_connection.proto
[ 40%] transform_to_lite /data/mysql-8.0.18/plugin/x/protocol/protobuf/mysqlx_expect.proto
[ 40%] transform_to_lite /data/mysql-8.0.18/plugin/x/protocol/protobuf/mysqlx_expr.proto
[ 40%] transform_to_lite /data/mysql-8.0.18/plugin/x/protocol/protobuf/mysqlx_crud.proto
[ 40%] transform_to_lite /data/mysql-8.0.18/plugin/x/protocol/protobuf/mysqlx_sql.proto
[ 40%] transform_to_lite /data/mysql-8.0.18/plugin/x/protocol/protobuf/mysqlx_session.proto
[ 40%] transform_to_lite /data/mysql-8.0.18/plugin/x/protocol/protobuf/mysqlx_notice.proto
[ 40%] transform_to_lite /data/mysql-8.0.18/plugin/x/protocol/protobuf/mysqlx_resultset.proto
[ 40%] transform_to_lite /data/mysql-8.0.18/plugin/x/protocol/protobuf/mysqlx_cursor.proto
[ 40%] transform_to_lite /data/mysql-8.0.18/plugin/x/protocol/protobuf/mysqlx_prepare.proto
[ 40%] Built target GenLiteProtos
[ 40%] Running C++ protocol buffer compiler (lite) on /data/mysql-8.0.18/plugin/x/protocol/protobuf/mysqlx.proto
../../../../runtime_output_directory/protoc: /lib64/libstdc++.so.6: version `GLIBCXX_3.4.21' not found (required by ../../../../runtime_output_directory/protoc)
../../../../runtime_output_directory/protoc: /lib64/libstdc++.so.6: version `GLIBCXX_3.4.20' not found (required by /data/mysql-8.0.18/bld/library_output_directory/libprotoc.so.3.6.1)
../../../../runtime_output_directory/protoc: /lib64/libstdc++.so.6: version `CXXABI_1.3.8' not found (required by /data/mysql-8.0.18/bld/library_output_directory/libprotoc.so.3.6.1)
../../../../runtime_output_directory/protoc: /lib64/libstdc++.so.6: version `CXXABI_1.3.9' not found (required by /data/mysql-8.0.18/bld/library_output_directory/libprotoc.so.3.6.1)
../../../../runtime_output_directory/protoc: /lib64/libstdc++.so.6: version `GLIBCXX_3.4.21' not found (required by /data/mysql-8.0.18/bld/library_output_directory/libprotoc.so.3.6.1)
../../../../runtime_output_directory/protoc: /lib64/libstdc++.so.6: version `GLIBCXX_3.4.20' not found (required by /data/mysql-8.0.18/bld/library_output_directory/libprotobuf.so.3.6.1)
../../../../runtime_output_directory/protoc: /lib64/libstdc++.so.6: version `CXXABI_1.3.8' not found (required by /data/mysql-8.0.18/bld/library_output_directory/libprotobuf.so.3.6.1)
../../../../runtime_output_directory/protoc: /lib64/libstdc++.so.6: version `CXXABI_1.3.9' not found (required by /data/mysql-8.0.18/bld/library_output_directory/libprotobuf.so.3.6.1)
../../../../runtime_output_directory/protoc: /lib64/libstdc++.so.6: version `GLIBCXX_3.4.21' not found (required by /data/mysql-8.0.18/bld/library_output_directory/libprotobuf.so.3.6.1)
make[2]: *** [plugin/x/generated/protobuf_lite/mysqlx.pb.cc] Error 1
make[1]: *** [plugin/x/protocol/protobuf/CMakeFiles/mysqlxmessages_lite.dir/all] Error 2
make: *** [all] Error 2








Cmake process in the following, i don't know Whether it can help:

[root@mydb3 bld]# cmake .. -DWITH_BOOST=../boost/boost_1_70_0/ -DCMAKE_INSTALL_PREFIX=../bin -DWITH_SSL=system -DWITH_SYSTEMD=1 -DBUILD_CONFIG=mysql_release -DMYSQL_DATADIR=/data/dmain -DWITHOUT_CSV_STORAGE_ENGINE=1 -DWITHOUT_BLACKHOLD_STORAGE_ENGINE=1 -DWITHOUT_FEDERATED_STORAGE_ENGINE=1 -DWITHOUT_ARCHIVE_STORAGE_ENGINE=1 -DWITHOUT_MRG_MYISAM_STORAGE_ENGINE=1 -DWITHOUT_NDBCLUSTER_STORAGE_ENGINE=1 -DFORCE_INSOURCE_BUILD=1 -DCMAKE_CXX_COMPILER=/usr/local/gcc-8.3.0/bin/g++ -DCMAKE_C_COMPILER=/usr/local/gcc-8.3.0/bin/gcc
-- Running cmake version 3.15.2
-- Could NOT find Git (missing: GIT_EXECUTABLE)
-- MySQL 8.0.18
-- The C compiler identification is GNU 8.3.0
-- The CXX compiler identification is GNU 8.3.0
-- Check for working C compiler: /usr/local/gcc-8.3.0/bin/gcc
-- Check for working C compiler: /usr/local/gcc-8.3.0/bin/gcc -- works
-- Detecting C compiler ABI info
-- Detecting C compiler ABI info - done
-- Detecting C compile features
-- Detecting C compile features - done
-- Check for working CXX compiler: /usr/local/gcc-8.3.0/bin/g++
-- Check for working CXX compiler: /usr/local/gcc-8.3.0/bin/g++ -- works
-- Detecting CXX compiler ABI info
-- Detecting CXX compiler ABI info - done
-- Detecting CXX compile features
-- Detecting CXX compile features - done
-- Source directory /data/mysql-8.0.18
-- Binary directory /data/mysql-8.0.18/bld
-- CMAKE_GENERATOR: Unix Makefiles
-- Looking for SHM_HUGETLB
-- Looking for SHM_HUGETLB - found
-- Looking for sys/types.h
-- Looking for sys/types.h - found
-- Looking for stdint.h
-- Looking for stdint.h - found
-- Looking for stddef.h
-- Looking for stddef.h - found
-- Check size of void *
-- Check size of void * - done
-- SIZEOF_VOIDP 8
-- Performing Test HAVE_C_FLOATING_POINT_FUSED_MADD
-- Performing Test HAVE_C_FLOATING_POINT_FUSED_MADD - Failed
-- Performing Test HAVE_CXX_FLOATING_POINT_FUSED_MADD
-- Performing Test HAVE_CXX_FLOATING_POINT_FUSED_MADD - Failed
-- Packaging as: mysql-8.0.18-Linux-x86_64
-- Performing Test C_LD_LLD_RESULT
-- Performing Test C_LD_LLD_RESULT - Failed
-- Performing Test CXX_LD_LLD_RESULT
-- Performing Test CXX_LD_LLD_RESULT - Failed
-- Performing Test C_LD_GOLD_RESULT
-- Performing Test C_LD_GOLD_RESULT - Success
-- Performing Test CXX_LD_GOLD_RESULT
-- Performing Test CXX_LD_GOLD_RESULT - Success
-- Local boost dir /data/mysql-8.0.18/boost/boost_1_70_0
-- Found /data/mysql-8.0.18/boost/boost_1_70_0/boost/version.hpp
-- BOOST_VERSION_NUMBER is #define BOOST_VERSION 107000
-- BOOST_INCLUDE_DIR /data/mysql-8.0.18/boost/boost_1_70_0
-- Enabling installation of systemd support files...
-- Checking for module 'systemd'
-- Found systemd, version 219
-- SYSTEMD_SERVICES_DIR /usr/lib/systemd/system
-- SYSTEMD_TMPFILES_DIR /usr/lib/tmpfiles.d
-- SYSTEMD_SERVICE_NAME mysqld
-- SYSTEMD_PID_DIR /var/run/mysqld
-- Performing Test HAVE_LLVM_LIBCPP
-- Performing Test HAVE_LLVM_LIBCPP - Failed
-- Looking for pthread.h
-- Looking for pthread.h - found
-- Performing Test CMAKE_HAVE_LIBC_PTHREAD
-- Performing Test CMAKE_HAVE_LIBC_PTHREAD - Failed
-- Looking for pthread_create in pthreads
-- Looking for pthread_create in pthreads - not found
-- Looking for pthread_create in pthread
-- Looking for pthread_create in pthread - found
-- Found Threads: TRUE
-- Looking for floor
-- Looking for floor - not found
-- Looking for floor in m
-- Looking for floor in m - found
-- Looking for gethostbyname_r
-- Looking for gethostbyname_r - found
-- Looking for bind
-- Looking for bind - found
-- Looking for crypt
-- Looking for crypt - not found
-- Looking for crypt in crypt
-- Looking for crypt in crypt - found
-- Looking for setsockopt
-- Looking for setsockopt - found
-- Looking for dlopen
-- Looking for dlopen - not found
-- Looking for dlopen in dl
-- Looking for dlopen in dl - found
-- Looking for sched_yield
-- Looking for sched_yield - found
-- Looking for clock_gettime
-- Looking for clock_gettime - found
-- Looking for timer_create
-- Looking for timer_create - not found
-- Looking for timer_create in rt
-- Looking for timer_create in rt - found
-- Looking for atomic_thread_fence
-- Looking for atomic_thread_fence - not found
-- Looking for atomic_thread_fence in atomic
-- Looking for atomic_thread_fence in atomic - found
-- Looking for backtrace
-- Looking for backtrace - found
-- Looking for include file alloca.h
-- Looking for include file alloca.h - found
-- Looking for include file arpa/inet.h
-- Looking for include file arpa/inet.h - found
-- Looking for include file dlfcn.h
-- Looking for include file dlfcn.h - found
-- Looking for include file endian.h
-- Looking for include file endian.h - found
-- Looking for include file execinfo.h
-- Looking for include file execinfo.h - found
-- Looking for include file fpu_control.h
-- Looking for include file fpu_control.h - found
-- Looking for include file grp.h
-- Looking for include file grp.h - found
-- Looking for include file ieeefp.h
-- Looking for include file ieeefp.h - not found
-- Looking for include file langinfo.h
-- Looking for include file langinfo.h - found
-- Looking for include file malloc.h
-- Looking for include file malloc.h - found
-- Looking for include file netinet/in.h
-- Looking for include file netinet/in.h - found
-- Looking for include file poll.h
-- Looking for include file poll.h - found
-- Looking for include file pwd.h
-- Looking for include file pwd.h - found
-- Looking for include file strings.h
-- Looking for include file strings.h - found
-- Looking for include file sys/cdefs.h
-- Looking for include file sys/cdefs.h - found
-- Looking for include file sys/ioctl.h
-- Looking for include file sys/ioctl.h - found
-- Looking for include file sys/mman.h
-- Looking for include file sys/mman.h - found
-- Looking for include file sys/prctl.h
-- Looking for include file sys/prctl.h - found
-- Looking for include file sys/resource.h
-- Looking for include file sys/resource.h - found
-- Looking for include file sys/select.h
-- Looking for include file sys/select.h - found
-- Looking for include file sys/socket.h
-- Looking for include file sys/socket.h - found
-- Looking for include files curses.h, term.h
-- Looking for include files curses.h, term.h - found
-- Looking for include file termios.h
-- Looking for include file termios.h - found
-- Looking for include file termio.h
-- Looking for include file termio.h - found
-- Looking for include file unistd.h
-- Looking for include file unistd.h - found
-- Looking for include file sys/wait.h
-- Looking for include file sys/wait.h - found
-- Looking for include file sys/param.h
-- Looking for include file sys/param.h - found
-- Looking for include file fnmatch.h
-- Looking for include file fnmatch.h - found
-- Looking for include file sys/un.h
-- Looking for include file sys/un.h - found
-- Looking for include file vis.h
-- Looking for include file vis.h - not found
-- Looking for include file sasl/sasl.h
-- Looking for include file sasl/sasl.h - not found
-- Looking for include file sys/devpoll.h
-- Looking for include file sys/devpoll.h - not found
-- Looking for include file sys/epoll.h
-- Looking for include file sys/epoll.h - found
-- Looking for TAILQ_FOREACH
-- Looking for TAILQ_FOREACH - found
-- Looking for _aligned_malloc
-- Looking for _aligned_malloc - not found
-- Looking for backtrace
-- Looking for backtrace - found
-- Looking for index
-- Looking for index - found
-- Looking for chown
-- Looking for chown - found
-- Looking for cuserid
-- Looking for cuserid - found
-- Looking for directio
-- Looking for directio - not found
-- Looking for ftruncate
-- Looking for ftruncate - found
-- Looking for fchmod
-- Looking for fchmod - found
-- Looking for fcntl
-- Looking for fcntl - found
-- Looking for fdatasync
-- Looking for fdatasync - found
-- Looking for fdatasync
-- Looking for fdatasync - found
-- Looking for fedisableexcept
-- Looking for fedisableexcept - found
-- Looking for fseeko
-- Looking for fseeko - found
-- Looking for fsync
-- Looking for fsync - found
-- Looking for gethrtime
-- Looking for gethrtime - not found
-- Looking for getnameinfo
-- Looking for getnameinfo - found
-- Looking for getpass
-- Looking for getpass - found
-- Looking for getpassphrase
-- Looking for getpassphrase - not found
-- Looking for getpwnam
-- Looking for getpwnam - found
-- Looking for getpwuid
-- Looking for getpwuid - found
-- Looking for getrlimit
-- Looking for getrlimit - found
-- Looking for getrusage
-- Looking for getrusage - found
-- Looking for initgroups
-- Looking for initgroups - found
-- Looking for issetugid
-- Looking for issetugid - not found
-- Looking for getuid
-- Looking for getuid - found
-- Looking for geteuid
-- Looking for geteuid - found
-- Looking for getgid
-- Looking for getgid - found
-- Looking for getegid
-- Looking for getegid - found
-- Looking for madvise
-- Looking for madvise - found
-- Looking for malloc_info
-- Looking for malloc_info - found
-- Looking for memrchr
-- Looking for memrchr - found
-- Looking for mlock
-- Looking for mlock - found
-- Looking for mlockall
-- Looking for mlockall - found
-- Looking for mmap64
-- Looking for mmap64 - found
-- Looking for poll
-- Looking for poll - found
-- Looking for posix_fallocate
-- Looking for posix_fallocate - found
-- Looking for posix_memalign
-- Looking for posix_memalign - found
-- Looking for pread
-- Looking for pread - found
-- Looking for pthread_condattr_setclock
-- Looking for pthread_condattr_setclock - found
-- Looking for pthread_getaffinity_np
-- Looking for pthread_getaffinity_np - found
-- Looking for pthread_sigmask
-- Looking for pthread_sigmask - found
-- Looking for setfd
-- Looking for setfd - not found
-- Looking for sigaction
-- Looking for sigaction - found
-- Looking for sleep
-- Looking for sleep - found
-- Looking for stpcpy
-- Looking for stpcpy - found
-- Looking for stpncpy
-- Looking for stpncpy - found
-- Looking for strlcpy
-- Looking for strlcpy - not found
-- Looking for strndup
-- Looking for strndup - found
-- Looking for strlcat
-- Looking for strlcat - not found
-- Looking for strsignal
-- Looking for strsignal - found
-- Looking for fgetln
-- Looking for fgetln - not found
-- Looking for strsep
-- Looking for strsep - found
-- Looking for tell
-- Looking for tell - not found
-- Looking for vasprintf
-- Looking for vasprintf - found
-- Looking for memalign
-- Looking for memalign - found
-- Looking for nl_langinfo
-- Looking for nl_langinfo - found
-- Looking for ntohll
-- Looking for ntohll - not found
-- Looking for epoll_create
-- Looking for epoll_create - found
-- Looking for inet_ntop
-- Looking for inet_ntop - found
-- Looking for kqueue
-- Looking for kqueue - not found
-- Looking for timeradd
-- Looking for timeradd - found
-- Looking for timerclear
-- Looking for timerclear - found
-- Looking for timercmp
-- Looking for timercmp - found
-- Looking for timerisset
-- Looking for timerisset - found
-- Looking for include file sys/time.h
-- Looking for include file sys/time.h - found
-- Looking for include file sys/times.h
-- Looking for include file sys/times.h - found
-- Looking for times
-- Looking for times - found
-- Looking for gettimeofday
-- Looking for gettimeofday - found
-- Looking for lrand48
-- Looking for lrand48 - found
-- Looking for TIOCGWINSZ
-- Looking for TIOCGWINSZ - found
-- Looking for FIONREAD
-- Looking for FIONREAD - found
-- Looking for FIONREAD
-- Looking for FIONREAD - not found
-- Looking for MADV_DONTDUMP
-- Looking for MADV_DONTDUMP - found
-- Performing Test HAVE_O_TMPFILE
-- Performing Test HAVE_O_TMPFILE - Failed
-- Looking for isinf
-- Looking for isinf - found
-- Performing Test HAVE_CXX_ISINF
-- Performing Test HAVE_CXX_ISINF - Success
-- Looking for timer_create
-- Looking for timer_create - found
-- Looking for timer_settime
-- Looking for timer_settime - found
-- Looking for kqueue
-- Looking for kqueue - not found
-- Performing Test HAVE_SETNS
-- Performing Test HAVE_SETNS - Failed
-- Looking for EVFILT_TIMER
-- Looking for EVFILT_TIMER - not found
-- Check if the system is big endian
-- Searching 16 bit integer
-- Check size of unsigned short
-- Check size of unsigned short - done
-- Using unsigned short
-- Check if the system is big endian - little endian
-- Check size of char *
-- Check size of char * - done
-- Check size of long
-- Check size of long - done
-- Check size of short
-- Check size of short - done
-- Check size of int
-- Check size of int - done
-- Check size of long long
-- Check size of long long - done
-- Check size of off_t
-- Check size of off_t - done
-- Check size of time_t
-- Check size of time_t - done
-- Performing Test HAVE_TM_GMTOFF
-- Performing Test HAVE_TM_GMTOFF - Success
-- Check size of ulong
-- Check size of ulong - done
-- Check size of u_int32_t
-- Check size of u_int32_t - done
-- Check size of socklen_t
-- Check size of socklen_t - done
-- Performing Test HAVE_VISIBILITY_HIDDEN
-- Performing Test HAVE_VISIBILITY_HIDDEN - Success
-- Performing Test HAVE_CLOCK_GETTIME
-- Performing Test HAVE_CLOCK_GETTIME - Failed
-- Performing Test HAVE_CLOCK_REALTIME
-- Performing Test HAVE_CLOCK_REALTIME - Failed
-- Checking stack direction : -1
-- Looking for include files time.h, sys/time.h
-- Looking for include files time.h, sys/time.h - found
-- Looking for O_NONBLOCK
-- Looking for O_NONBLOCK - found
-- Performing Test HAVE_PAUSE_INSTRUCTION
-- Performing Test HAVE_PAUSE_INSTRUCTION - Failed
-- Performing Test HAVE_FAKE_PAUSE_INSTRUCTION
-- Performing Test HAVE_FAKE_PAUSE_INSTRUCTION - Success
-- Performing Test HAVE_HMT_PRIORITY_INSTRUCTION
-- Performing Test HAVE_HMT_PRIORITY_INSTRUCTION - Failed
-- Looking for C++ include cxxabi.h
-- Looking for C++ include cxxabi.h - found
-- Performing Test HAVE_ABI_CXA_DEMANGLE
-- Performing Test HAVE_ABI_CXA_DEMANGLE - Success
-- Performing Test HAVE_BUILTIN_UNREACHABLE
-- Performing Test HAVE_BUILTIN_UNREACHABLE - Success
-- Performing Test HAVE_BUILTIN_EXPECT
-- Performing Test HAVE_BUILTIN_EXPECT - Success
-- Performing Test HAVE_BUILTIN_STPCPY
-- Performing Test HAVE_BUILTIN_STPCPY - Success
-- Performing Test HAVE_GCC_ATOMIC_BUILTINS
-- Performing Test HAVE_GCC_ATOMIC_BUILTINS - Success
-- Performing Test HAVE_GCC_SYNC_BUILTINS
-- Performing Test HAVE_GCC_SYNC_BUILTINS - Success
-- Performing Test HAVE_SYS_GETTID
-- Performing Test HAVE_SYS_GETTID - Success
-- Performing Test HAVE_PTHREAD_GETTHREADID_NP
-- Performing Test HAVE_PTHREAD_GETTHREADID_NP - Failed
-- Performing Test HAVE_PTHREAD_THREADID_NP
-- Performing Test HAVE_PTHREAD_THREADID_NP - Failed
-- Performing Test HAVE_INTEGER_PTHREAD_SELF
-- Performing Test HAVE_INTEGER_PTHREAD_SELF - Success
-- Looking for netinet/in6.h
-- Looking for netinet/in6.h - not found
-- Check size of struct in6_addr
-- Check size of struct in6_addr - failed
-- Performing Test HAVE_SOCKADDR_IN_SIN_LEN
-- Performing Test HAVE_SOCKADDR_IN_SIN_LEN - Failed
-- Performing Test HAVE_SOCKADDR_IN6_SIN6_LEN
-- Performing Test HAVE_SOCKADDR_IN6_SIN6_LEN - Failed
-- Looking for include file numa.h
-- Looking for include file numa.h - not found
-- Looking for include file numaif.h
-- Looking for include file numaif.h - not found
-- NUMA library missing or required version not available
-- Check size of off64_t
-- Check size of off64_t - done
-- Looking for unistd.h
-- Looking for unistd.h - found
-- ZSTD_LIBRARY(Bundled) zstd
-- ZSTD_LEGACY_SUPPORT not defined!
-- The openssl command does support zlib
-- OPENSSL_INCLUDE_DIR = /usr/include
-- OPENSSL_LIBRARY = /usr/lib64/libssl.so
-- CRYPTO_LIBRARY = /usr/lib64/libcrypto.so
-- OPENSSL_MAJOR_VERSION = 1
-- OPENSSL_MINOR_VERSION = 00
-- OPENSSL_FIX_VERSION = 02
-- Looking for SHA512_DIGEST_LENGTH
-- Looking for SHA512_DIGEST_LENGTH - found
-- SSL_LIBRARIES = /usr/lib64/libssl.so;/usr/lib64/libcrypto.so;dl
-- Check size of mbstate_t
-- Check size of mbstate_t - done
-- Performing Test HAVE_LANGINFO_CODESET
-- Performing Test HAVE_LANGINFO_CODESET - Success
-- Looking for wcsdup
-- Looking for wcsdup - found
-- Check size of wchar_t
-- Check size of wchar_t - done
-- Check size of wint_t
-- Check size of wint_t - done
-- Found Curses: /usr/lib64/libcurses.so
-- Looking for tputs in /usr/lib64/libcurses.so
-- Looking for tputs in /usr/lib64/libcurses.so - found
-- Performing Test HAVE_DECL_TGOTO
-- Performing Test HAVE_DECL_TGOTO - Success
-- Looking for strvis
-- Looking for strvis - not found
-- Looking for strunvis
-- Looking for strunvis - not found
-- Performing Test HAVE_STRINGOP_OVERFLOW
-- Performing Test HAVE_STRINGOP_OVERFLOW - Success
-- Could NOT find Git (missing: GIT_EXECUTABLE)
-- Performing Test check_c_compiler_flag__Wall
-- Performing Test check_c_compiler_flag__Wall - Success
-- Performing Test check_c_compiler_flag__Wswitch
-- Performing Test check_c_compiler_flag__Wswitch - Success
-- Performing Test check_c_compiler_flag__fno_strict_aliasing
-- Performing Test check_c_compiler_flag__fno_strict_aliasing - Success
-- Looking for __GNU_LIBRARY__
-- Looking for __GNU_LIBRARY__ - found
-- Looking for sys/types.h
-- Looking for sys/types.h - found
-- Looking for sys/socket.h
-- Looking for sys/socket.h - found
-- Looking for netinet/in.h
-- Looking for netinet/in.h - found
-- Looking for netinet/in6.h
-- Looking for netinet/in6.h - not found
-- Looking for unistd.h
-- Looking for unistd.h - found
-- Looking for netdb.h
-- Looking for netdb.h - found
-- Looking for dlfcn.h
-- Looking for dlfcn.h - found
-- Looking for arpa/inet.h
-- Looking for arpa/inet.h - found
-- Looking for fcntl.h
-- Looking for fcntl.h - found
-- Looking for inttypes.h
-- Looking for inttypes.h - found
-- Looking for memory.h
-- Looking for memory.h - found
-- Looking for poll.h
-- Looking for poll.h - found
-- Looking for port.h
-- Looking for port.h - not found
-- Looking for signal.h
-- Looking for signal.h - found
-- Looking for stdarg.h
-- Looking for stdarg.h - found
-- Looking for stddef.h
-- Looking for stddef.h - found
-- Looking for stdint.h
-- Looking for stdint.h - found
-- Looking for stdlib.h
-- Looking for stdlib.h - found
-- Looking for strings.h
-- Looking for strings.h - found
-- Looking for string.h
-- Looking for string.h - found
-- Looking for sys/devpoll.h
-- Looking for sys/devpoll.h - not found
-- Looking for sys/epoll.h
-- Looking for sys/epoll.h - found
-- Looking for sys/eventfd.h
-- Looking for sys/eventfd.h - found
-- Looking for sys/event.h
-- Looking for sys/event.h - not found
-- Looking for sys/ioctl.h
-- Looking for sys/ioctl.h - found
-- Looking for sys/mman.h
-- Looking for sys/mman.h - found
-- Looking for sys/param.h
-- Looking for sys/param.h - found
-- Looking for sys/queue.h
-- Looking for sys/queue.h - found
-- Looking for sys/select.h
-- Looking for sys/select.h - found
-- Looking for sys/sendfile.h
-- Looking for sys/sendfile.h - found
-- Looking for sys/stat.h
-- Looking for sys/stat.h - found
-- Looking for sys/time.h
-- Looking for sys/time.h - found
-- Looking for sys/uio.h
-- Looking for sys/uio.h - found
-- Looking for include files sys/types.h, ifaddrs.h
-- Looking for include files sys/types.h, ifaddrs.h - found
-- Looking for mach/mach_time.h
-- Looking for mach/mach_time.h - not found
-- Looking for netinet/tcp.h
-- Looking for netinet/tcp.h - found
-- Looking for sys/wait.h
-- Looking for sys/wait.h - found
-- Looking for sys/resource.h
-- Looking for sys/resource.h - found
-- Looking for sys/sysctl.h
-- Looking for sys/sysctl.h - found
-- Looking for sys/timerfd.h
-- Looking for sys/timerfd.h - found
-- Looking for errno.h
-- Looking for errno.h - found
-- Looking for epoll_create
-- Looking for epoll_create - found
-- Looking for epoll_ctl
-- Looking for epoll_ctl - found
-- Looking for eventfd
-- Looking for eventfd - found
-- Looking for clock_gettime
-- Looking for clock_gettime - found
-- Looking for fcntl
-- Looking for fcntl - found
-- Looking for getaddrinfo
-- Looking for getaddrinfo - found
-- Looking for getnameinfo
-- Looking for getnameinfo - found
-- Looking for gettimeofday
-- Looking for gettimeofday - found
-- Looking for getprotobynumber
-- Looking for getprotobynumber - found
-- Looking for getservbyname
-- Looking for getservbyname - found
-- Looking for inet_ntop
-- Looking for inet_ntop - found
-- Looking for inet_pton
-- Looking for inet_pton - found
-- Looking for kqueue
-- Looking for kqueue - not found
-- Looking for mmap
-- Looking for mmap - found
-- Looking for pipe
-- Looking for pipe - found
-- Looking for pipe2
-- Looking for pipe2 - found
-- Looking for poll
-- Looking for poll - found
-- Looking for port_create
-- Looking for port_create - not found
-- Looking for sendfile
-- Looking for sendfile - found
-- Looking for sigaction
-- Looking for sigaction - found
-- Looking for signal
-- Looking for signal - found
-- Looking for splice
-- Looking for splice - found
-- Looking for strlcpy
-- Looking for strlcpy - not found
-- Looking for strsep
-- Looking for strsep - found
-- Looking for strtok_r
-- Looking for strtok_r - found
-- Looking for strtoll
-- Looking for strtoll - found
-- Looking for vasprintf
-- Looking for vasprintf - found
-- Looking for sysctl
-- Looking for sysctl - found
-- Looking for accept4
-- Looking for accept4 - found
-- Looking for arc4random
-- Looking for arc4random - not found
-- Looking for arc4random_buf
-- Looking for arc4random_buf - not found
-- Looking for epoll_create1
-- Looking for epoll_create1 - found
-- Looking for getegid
-- Looking for getegid - found
-- Looking for geteuid
-- Looking for geteuid - found
-- Looking for getifaddrs
-- Looking for getifaddrs - found
-- Looking for issetugid
-- Looking for issetugid - not found
-- Looking for mach_absolute_time
-- Looking for mach_absolute_time - not found
-- Looking for nanosleep
-- Looking for nanosleep - found
-- Looking for usleep
-- Looking for usleep - found
-- Looking for timeradd
-- Looking for timeradd - not found
-- Looking for timerclear
-- Looking for timerclear - not found
-- Looking for timercmp
-- Looking for timercmp - not found
-- Looking for timerfd_create
-- Looking for timerfd_create - found
-- Looking for timerisset
-- Looking for timerisset - not found
-- Looking for putenv
-- Looking for putenv - found
-- Looking for setenv
-- Looking for setenv - found
-- Looking for setrlimit
-- Looking for setrlimit - found
-- Looking for umask
-- Looking for umask - found
-- Looking for unsetenv
-- Looking for unsetenv - found
-- Looking for gethostbyname_r
-- Looking for gethostbyname_r - found
-- Checking prototype gethostbyname_r for EVENT__HAVE_GETHOSTBYNAME_R_3_ARG - False
-- Checking prototype gethostbyname_r for EVENT__HAVE_GETHOSTBYNAME_R_5_ARG - False
-- Checking prototype gethostbyname_r for EVENT__HAVE_GETHOSTBYNAME_R_6_ARG - True
-- Looking for select
-- Looking for select - found
-- Check size of uint8_t
-- Check size of uint8_t - done
-- Check size of uint16_t
-- Check size of uint16_t - done
-- Check size of uint32_t
-- Check size of uint32_t - done
-- Check size of uint64_t
-- Check size of uint64_t - done
-- Check size of short
-- Check size of short - done
-- Check size of int
-- Check size of int - done
-- Check size of unsigned
-- Check size of unsigned - done
-- Check size of unsigned int
-- Check size of unsigned int - done
-- Check size of long
-- Check size of long - done
-- Check size of long long
-- Check size of long long - done
-- Performing Test HAVE_INLINE
-- Performing Test HAVE_INLINE - Success
-- Looking for TAILQ_FOREACH
-- Looking for TAILQ_FOREACH - found
-- Looking for CTL_KERN
-- Looking for CTL_KERN - not found
-- Looking for KERN_ARND
-- Looking for KERN_ARND - not found
-- Looking for KERN_RANDOM
-- Looking for KERN_RANDOM - not found
-- Looking for RANDOM_UUID
-- Looking for RANDOM_UUID - not found
-- Looking for F_SETFD
-- Looking for F_SETFD - found
-- Check size of fd_mask
-- Check size of fd_mask - done
-- Check size of size_t
-- Check size of size_t - done
-- Check size of off_t
-- Check size of off_t - done
-- Check size of ssize_t
-- Check size of ssize_t - done
-- Check size of SSIZE_T
-- Check size of SSIZE_T - failed
-- Check size of socklen_t
-- Check size of socklen_t - done
-- Check size of pid_t
-- Check size of pid_t - done
-- Check size of pthread_t
-- Check size of pthread_t - done
-- Check size of uintptr_t
-- Check size of uintptr_t - done
-- Check size of void *
-- Check size of void * - done
-- Performing Test EVENT__HAVE_WAITPID_WITH_WNOWAIT
-- Performing Test EVENT__HAVE_WAITPID_WITH_WNOWAIT - Failed
-- Looking for _MINIX
-- Looking for _MINIX - not found
-- Looking for _POSIX_1_SOURCE
-- Looking for _POSIX_1_SOURCE - not found
-- Looking for _POSIX_SOURCE
-- Looking for _POSIX_SOURCE - found
-- Check size of struct addrinfo
-- Check size of struct addrinfo - done
-- Check size of struct in6_addr
-- Check size of struct in6_addr - done
-- Performing Test EVENT__HAVE_STRUCT_IN6_ADDR_S6_ADDR16
-- Performing Test EVENT__HAVE_STRUCT_IN6_ADDR_S6_ADDR16 - Success
-- Performing Test EVENT__HAVE_STRUCT_IN6_ADDR_S6_ADDR32
-- Performing Test EVENT__HAVE_STRUCT_IN6_ADDR_S6_ADDR32 - Success
-- Check size of sa_family_t
-- Check size of sa_family_t - done
-- Check size of struct sockaddr_in6
-- Check size of struct sockaddr_in6 - done
-- Performing Test EVENT__HAVE_STRUCT_SOCKADDR_IN6_SIN6_LEN
-- Performing Test EVENT__HAVE_STRUCT_SOCKADDR_IN6_SIN6_LEN - Failed
-- Performing Test EVENT__HAVE_STRUCT_SOCKADDR_IN_SIN_LEN
-- Performing Test EVENT__HAVE_STRUCT_SOCKADDR_IN_SIN_LEN - Failed
-- Check size of struct sockaddr_storage
-- Check size of struct sockaddr_storage - done
-- Performing Test EVENT__HAVE_STRUCT_SOCKADDR_STORAGE_SS_FAMILY
-- Performing Test EVENT__HAVE_STRUCT_SOCKADDR_STORAGE_SS_FAMILY - Success
-- Performing Test EVENT__HAVE_STRUCT_SOCKADDR_STORAGE___SS_FAMILY
-- Performing Test EVENT__HAVE_STRUCT_SOCKADDR_STORAGE___SS_FAMILY - Failed
-- Performing Test HAVE_CXX_W_unused_but_set_variable
-- Performing Test HAVE_CXX_W_unused_but_set_variable - Success
-- Performing Test HAVE_CXX_W_misleading_indentation
-- Performing Test HAVE_CXX_W_misleading_indentation - Success
-- Performing Test HAVE_CXX_W_maybe_uninitialized
-- Performing Test HAVE_CXX_W_maybe_uninitialized - Success
-- ICU_MAJOR_VERSION = 59
-- ICU_INCLUDE_DIRS /data/mysql-8.0.18/extra/icu/source/common;/data/mysql-8.0.18/extra/icu/source/stubdata;/data/mysql-8.0.18/extra/icu/source/i18n
-- ICU_LIBRARIES icui18n;icuuc;icustubdata
-- Cannot find system sasl libraries.
-- WITH_PROTOBUF=bundled
-- PROTOBUF_VERSION_NUMBER is #define GOOGLE_PROTOBUF_VERSION 3006001
-- PROTOBUF_INCLUDE_DIR /data/mysql-8.0.18/extra/protobuf/protobuf-3.6.1/src
-- PROTOBUF_LIBRARY libprotobuf
-- PROTOBUF_LITE_LIBRARY libprotobuf-lite
-- PROTOBUF_PROTOC_EXECUTABLE protoc
-- No WITH_CURL has been set. Not using any curl library.
-- CURL_LIBRARY =
-- CURL_INCLUDE_DIR =
-- RAPIDJSON_INCLUDE_DIR /data/mysql-8.0.18/extra/rapidjson/include
-- RAPIDJSON_MAJOR_VERSION is 1
-- RAPIDJSON_MINOR_VERSION is 1
-- Performing Test HAVE_PTHREAD_SETNAME_NP
-- Performing Test HAVE_PTHREAD_SETNAME_NP - Success
-- Performing Test HAVE_CXX_W_deprecated_copy
-- Performing Test HAVE_CXX_W_deprecated_copy - Failed
-- Performing Test HAVE_CXX_W_extra_semi
-- Performing Test HAVE_CXX_W_extra_semi - Success
-- Performing Test HAVE_CXX_W_implicit_fallthrough_2
-- Performing Test HAVE_CXX_W_implicit_fallthrough_2 - Success
-- Performing Test HAVE_Wjump-misses-init
-- Performing Test HAVE_Wjump-misses-init - Success
-- Performing Test HAVE_CXX_W_logical_op
-- Performing Test HAVE_CXX_W_logical_op - Success
-- Googletest was not found. gtest-based unit tests will be disabled. You can run cmake . -DENABLE_DOWNLOADS=1 to automatically download and build required components from source.
-- If you are inside a firewall, you may need to use an https proxy: export https_proxy=http://example.com:80
-- Creating LDAP authentication SASL client library.
-- Currently LDAP SASL client authentication plug-in is build with only system installed cyrus SASL library.
-- Looking for include file sasl/sasl.h
-- Looking for include file sasl/sasl.h - not found
-- Looking for include file lber.h
-- Looking for include file lber.h - not found
-- Required SASL library is missing. Skipping the LDAP SASL client authentication plugin.
-- Library mysqlclient depends on OSLIBS -lpthread;m;rt;/usr/lib64/libssl.so;/usr/lib64/libcrypto.so;dl
-- MERGE_CONVENIENCE_LIBRARIES TARGET mysqlclient
-- MERGE_CONVENIENCE_LIBRARIES LIBS clientlib;mytime;strings;vio;mysys;zlib;zstd
-- Looking for le64toh
-- Looking for le64toh - found
-- Looking for le32toh
-- Looking for le32toh - found
-- Looking for le16toh
-- Looking for le16toh - found
-- Check if the system is big endian
-- Searching 16 bit integer
-- Using unsigned short
-- Check if the system is big endian - little endian
-- Looking for include file libaio.h
-- Looking for include file libaio.h - found
-- Looking for io_queue_init in aio
-- Looking for io_queue_init in aio - found
-- Performing Test HAVE_NO_BUILTIN_MEMCMP
-- Performing Test HAVE_NO_BUILTIN_MEMCMP - Success
-- Looking for sched_getcpu
-- Looking for sched_getcpu - found
-- Looking for nanosleep
-- Looking for nanosleep - found
-- Performing Test HAVE_FALLOC_PUNCH_HOLE_AND_KEEP_SIZE
-- Performing Test HAVE_FALLOC_PUNCH_HOLE_AND_KEEP_SIZE - Failed
-- Performing Test HAVE_IB_GCC_SYNC_SYNCHRONISE
-- Performing Test HAVE_IB_GCC_SYNC_SYNCHRONISE - Failed
-- Performing Test HAVE_IB_GCC_ATOMIC_THREAD_FENCE
-- Performing Test HAVE_IB_GCC_ATOMIC_THREAD_FENCE - Failed
-- Performing Test HAVE_IB_GCC_ATOMIC_COMPARE_EXCHANGE
-- Performing Test HAVE_IB_GCC_ATOMIC_COMPARE_EXCHANGE - Failed
-- Performing Test HAVE_IB_ATOMIC_PTHREAD_T_GCC
-- Performing Test HAVE_IB_ATOMIC_PTHREAD_T_GCC - Failed
-- Performing Test HAVE_IB_LINUX_FUTEX
-- Performing Test HAVE_IB_LINUX_FUTEX - Failed
-- Performing Test HAVE_CXX_W_cast_function_type
-- Performing Test HAVE_CXX_W_cast_function_type - Success
-- Performing Test HAVE_PEERCRED
-- Performing Test HAVE_PEERCRED - Success
-- Looking for htole64
-- Looking for htole64 - found
-- Looking for htole32
-- Looking for htole32 - found
-- Looking for htole16
-- Looking for htole16 - found
-- Found PkgConfig: /usr/bin/pkg-config (found version "0.27.1")
-- Checking for module 'libtirpc'
-- No package 'libtirpc' found
-- Performing Test HAVE_STRUCT_SOCKADDR_SA_LEN
-- Performing Test HAVE_STRUCT_SOCKADDR_SA_LEN - Failed
-- Performing Test HAVE_STRUCT_IFREQ_IFR_NAME
-- Performing Test HAVE_STRUCT_IFREQ_IFR_NAME - Success
-- Performing Test HAVE_XDR_OPS_X_PUTINT32
-- Performing Test HAVE_XDR_OPS_X_PUTINT32 - Success
-- Performing Test HAVE_XDR_OPS_X_GETINT32
-- Performing Test HAVE_XDR_OPS_X_GETINT32 - Success
-- Performing Test HAVE_RPC_INLINE_T
-- Performing Test HAVE_RPC_INLINE_T - Failed
-- Performing Test OLD_XDR
-- Performing Test OLD_XDR - Failed
-- Performing Test HAS_INCOMPATIBLE_POINTER_TYPES
-- Performing Test HAS_INCOMPATIBLE_POINTER_TYPES - Success
-- Performing Test X_PUTLONG_NOT_USE_CONST
-- Performing Test X_PUTLONG_NOT_USE_CONST - Failed
-- Checking for module 'libtirpc'
-- No package 'libtirpc' found
-- RPC_INCLUDE_DIRS /usr/include
-- Performing Test HAVE_CAST_FUNCTION_TYPE
-- Performing Test HAVE_CAST_FUNCTION_TYPE - Success
-- Performing Test HAVE_CXX_W_unused_but_set_parameter
-- Performing Test HAVE_CXX_W_unused_but_set_parameter - Success
-- MYSQLX - Text log of protobuf messages enabled
-- Found BISON: /usr/bin/bison (found version "3.0.4")
-- BISON outputs /data/mysql-8.0.18/bld/sql/sql_yacc.cc;/data/mysql-8.0.18/bld/sql/sql_yacc.h
-- BISON outputs /data/mysql-8.0.18/bld/sql/sql_hints.yy.cc;/data/mysql-8.0.18/bld/sql/sql_hints.yy.h
-- CONFIG_CLIENT_LIBS -lpthread -lm -lrt -lssl -lcrypto -ldl
-- CONFIG_LIBS_PRIVATE -lpthread -lm -lrt -ldl
-- INSTALL mysqlclient.pc lib/pkgconfig
-- MySQL 8.0.18
-- Looking for prlimit
-- Looking for prlimit - found
-- Performing Test COMPILER_HAS_HIDDEN_VISIBILITY
-- Performing Test COMPILER_HAS_HIDDEN_VISIBILITY - Success
-- Performing Test COMPILER_HAS_HIDDEN_INLINE_VISIBILITY
-- Performing Test COMPILER_HAS_HIDDEN_INLINE_VISIBILITY - Success
-- Performing Test COMPILER_HAS_DEPRECATED_ATTR
-- Performing Test COMPILER_HAS_DEPRECATED_ATTR - Success
-- Performing Test HAVE_CXX_W_error
-- Performing Test HAVE_CXX_W_error - Success
-- Performing Test HAVE_CXX_W_missing_noreturn
-- Performing Test HAVE_CXX_W_missing_noreturn - Success
-- Performing Test HAVE_CXX_W_conditional_uninitialized
-- Performing Test HAVE_CXX_W_conditional_uninitialized - Failed
-- Performing Test HAVE_CXX_W_suggest_attribute_format
-- Performing Test HAVE_CXX_W_suggest_attribute_format - Success
-- Performing Test HAVE_CXX_W_implicit_fallthrough
-- Performing Test HAVE_CXX_W_implicit_fallthrough - Success
-- Performing Test HAVE_CXX_W_format_truncation
-- Performing Test HAVE_CXX_W_format_truncation - Success
-- Performing Test HAVE_CXX_W_format_overflow
-- Performing Test HAVE_CXX_W_format_overflow - Success
-- Performing Test HAVE_CXX_W_parentheses_equality
-- Performing Test HAVE_CXX_W_parentheses_equality - Failed
-- Skipping deb packaging on unsupported platform Maipo.
-- Could NOT find Doxygen (missing: DOXYGEN_EXECUTABLE)
-- CMAKE_BUILD_TYPE: RelWithDebInfo
-- COMPILE_DEFINITIONS: _GNU_SOURCE;_FILE_OFFSET_BITS=64;RAPIDJSON_NO_SIZETYPEDEFINE;RAPIDJSON_SCHEMA_USE_INTERNALREGEX=0;RAPIDJSON_SCHEMA_USE_STDREGEX=1;HAVE_CONFIG_H;HAVE_OPENSSL;__STDC_LIMIT_MACROS;__STDC_FORMAT_MACROS;_USE_MATH_DEFINES;LZ4_DISABLE_DEPRECATE_WARNINGS;HAVE_LIBEVENT2;UNISTR_FROM_STRING_EXPLICIT=explicit;UNISTR_FROM_CHAR_EXPLICIT=explicit
-- CMAKE_C_FLAGS: -fno-omit-frame-pointer -Wall -Wextra -Wformat-security -Wvla -Wundef -Wmissing-format-attribute -Wwrite-strings -Wjump-misses-init
-- CMAKE_CXX_FLAGS: -std=c++14 -fno-omit-frame-pointer -Wall -Wextra -Wformat-security -Wvla -Wundef -Wmissing-format-attribute -Woverloaded-virtual -Wcast-qual -Wimplicit-fallthrough=2 -Wlogical-op
-- CMAKE_CXX_FLAGS_DEBUG: -DSAFE_MUTEX -DENABLED_DEBUG_SYNC -g
-- CMAKE_CXX_FLAGS_RELWITHDEBINFO: -DDBUG_OFF -ffunction-sections -fdata-sections -O2 -g -DNDEBUG
-- CMAKE_CXX_FLAGS_RELEASE: -DDBUG_OFF -ffunction-sections -fdata-sections -O3 -DNDEBUG
-- CMAKE_CXX_FLAGS_MINSIZEREL: -DDBUG_OFF -ffunction-sections -fdata-sections -Os -DNDEBUG
-- CMAKE_C_LINK_FLAGS: -fuse-ld=gold -Wl,--gc-sections
-- CMAKE_CXX_LINK_FLAGS: -fuse-ld=gold -Wl,--gc-sections
-- CMAKE_EXE_LINKER_FLAGS
-- CMAKE_MODULE_LINKER_FLAGS
-- CMAKE_SHARED_LINKER_FLAGS
-- Configuring done
-- Generating done
CMake Warning:
Manually-specified variables were not used by the project:

WITHOUT_BLACKHOLD_STORAGE_ENGINE
WITHOUT_MRG_MYISAM_STORAGE_ENGINE
WITHOUT_NDBCLUSTER_STORAGE_ENGINE


-- Build files have been written to: /data/mysql-8.0.18/bld
[root@mydb3 bld]#

Options: ReplyQuote


Subject
Views
Written By
Posted
Re: How can i make a MySQL8 tar package like offcial tar package through source build?
324
April 08, 2020 11:34PM


Sorry, only registered users may post in this forum.

Content reproduced on this site is the property of the respective copyright holders. It is not reviewed in advance by Oracle and does not necessarily represent the opinion of Oracle or any other party.